BDBM50167034 (1S,2S,4S,5R,6S)-2-Amino-4-methyl-bicyclo[3.1.0]hexane-2,6-dicarboxylic acid::CHEMBL365368
SMILES C[C@H]1C[C@](N)([C@H]2[C@@H]1[C@@H]2C(O)=O)C(O)=O
InChI Key InChIKey=BQVZICWQBFTOJX-DJBRRKJBSA-N
Data  2 KI  6 EC50
  Tab Delimited (TSV)   2D SDfile   Computed 3D by Vconf -m prep SDfile
Find this compound or compounds like it in BindingDB:
Activity Spreadsheet -- Enzyme Inhibition Constant Data from BindingDB
Found 1 hit for monomerid = 50167034
TargetMetabotropic glutamate receptor 8(Homo sapiens (Human))
Eli Lilly
Curated by ChEMBL
LigandPNGBDBM50167034((1S,2S,4S,5R,6S)-2-Amino-4-methyl-bicyclo[3.1.0]he...)
Affinity DataEC50: >2.50E+4nM. Assay description: Agonist activity at human mGlu8 receptor expressed in golden Syrian hamster AV12 cells coexpressing EAAT1 after 20 mins by FLIPR assay
In DepthDetails ArticlePubMed